{"text_format":"1","workbook":"xlsx","n_sheets":21,"sheets":["HOME","Region","Country","Multiple Countries","InputNewDisaster","EditRegionCountry","InputEPP","Output_Truc","Multiple_Truc","OL","OLM","ItemRequirementsQ1","Master","StatTrucOut","StatWithOut","ButtonOutputs","GF","Outliers","EPP","ItemData","DisasterSupplyBasis"],"not_rendered":{"charts":4,"images":1,"macros":1,"external_links":0,"defined_names":3,"comments":2,"pivot_tables":0},"unopened":[],"bounds":{"document_bytes":16777216,"sheet_cells":100000,"rows_first":2000,"rows_last":500,"rows_between":2000,"halvings":0,"cell_chars":16384,"cell_head_chars":4096},"cells_cut":0,"cells_raw":0,"read":"whole","date_system":"1900"}

{"sheet":"HOME","index":0,"n_rows":21,"n_cols":6,"rows_kept":21,"cut":false,"hidden":false,"merged":[[2,1,2,4],[14,1,14,3],[36,1,36,2],[37,1,37,2],[38,1,38,2],[35,1,35,2],[36,3,36,4],[37,3,37,4],[38,3,38,4],[35,3,35,4],[20,1,20,3],[44,3,44,4],[40,3,40,4],[48,5,48,7],[46,1,46,2],[40,1,40,2],[41,1,41,2],[42,1,42,2],[43,1,43,2],[44,1,44,2],[45,1,45,2],[45,3,45,4],[46,3,46,4],[41,5,41,7],[42,5,42,7],[43,5,43,7],[39,3,39,4],[41,8,41,9],[35,8,35,9],[35,5,35,7],[36,5,36,7],[37,5,37,7],[38,5,38,7],[39,5,39,7],[40,5,40,7],[40,8,40,9],[41,10,41,11],[42,8,42,9],[43,8,43,9],[41,3,41,4],[42,3,42,4],[43,3,43,4],[36,10,36,11],[37,10,37,11],[38,10,38,11],[39,10,39,11],[40,10,40,11],[50,3,50,4],[47,1,47,2],[48,1,48,2],[49,1,49,2],[50,1,50,2],[49,3,49,4],[47,3,47,4],[48,3,48,4],[44,8,44,9],[49,5,49,7],[50,5,50,7],[45,5,45,7],[46,5,46,7],[47,8,47,9],[45,8,45,9],[46,8,46,9],[44,5,44,7],[47,5,47,7],[46,10,46,11],[47,10,47,11],[47,12,47,14],[44,12,44,14],[45,12,45,14],[46,12,46,14],[43,12,43,14],[42,10,42,11],[43,10,43,11],[44,10,44,11],[45,10,45,11],[8,5,12,6],[14,5,18,6],[20,5,24,6],[41,12,41,14],[42,12,42,14],[36,12,36,14],[37,12,37,14],[38,12,38,14],[39,12,39,14],[40,12,40,14],[35,10,35,11],[35,12,35,14],[36,8,36,9],[37,8,37,9],[38,8,38,9],[39,8,39,9]]}
[]
[]
[null,"View Disaster Statisitcs By:"]
[]
[]
[]
[]
[]
[null,"Input New Disaster Data",null,null,null,"Insert a new disaster occurrence into the database. All new disasters inserted will be used for calculaing disaster statistics."]
[]
{"$rows_left_out":12}
{"sheet":"Region","index":1,"n_rows":5,"n_cols":8,"rows_kept":5,"cut":false,"hidden":false,"merged":[]}
[]
[]
[null,null,"Select a Region",null,null,null,null,"Select a Disaster"]
[]
[null,null,"Region:",null,null,null,null,"Disaster:"]

{"sheet":"Country","index":2,"n_rows":5,"n_cols":8,"rows_kept":5,"cut":false,"hidden":false,"merged":[[2,2,2,4],[2,7,2,9]]}
[]
[]
[null,null,"Select a Country",null,null,null,null,"Select a Disaster"]
[]
[null,null,"Country:",null,null,null,null,"Disaster:"]

{"sheet":"Multiple Countries","index":3,"n_rows":13,"n_cols":8,"rows_kept":13,"cut":false,"hidden":false,"merged":[[2,2,2,4],[2,7,2,9]]}
[]
[]
[null,null,"Select multiple countries:",null,null,null,null,"Select a Disaster:"]
[]
[null,null,"Country 1:",null,null,null,null,"Disaster:"]
[]
[null,null,"Country 2:"]
[]
[null,null,"Country 3:"]
[]
{"$rows_left_out":4}
{"sheet":"InputNewDisaster","index":4,"n_rows":22,"n_cols":9,"rows_kept":22,"cut":false,"hidden":false,"merged":[[0,0,0,1],[0,3,1,5],[3,4,6,4]]}
["Input New Disaster Form",null,null,"Important Notes",null,null,"month","day","year"]
[null,null,null,null,null,null,1,1,2009]
["Disaster Date",null,null,null,null,null,2,2,2010]
["Day",null,null,null,"If you insert disasters in the database, enter all disaters that have occurred in the specified country since your last update. If you only enter some disasters, the data will become skewed and the calculations will not be correct.                                         Updated Dec. 12, 2009 from http://emdat.be/",null,3,3,2011]
["Month",null,null,null,null,null,4,4,2012]
["Year",null,null,null,null,null,5,5,2013]
["Disaster Data",null,null,null,null,null,6,6,2014]
["Country  ",null,null,null,null,null,7,7,2015]
["Disaster Type",null,null,null,"Go to \"Settings\" tab to insert new countries not in the drop-down.",null,8,8,2016]
["Number of People Killed",null,null,null,null,null,null,9,2017]
{"$rows_left_out":13}
{"sheet":"EditRegionCountry","index":5,"n_rows":65,"n_cols":7,"rows_kept":65,"cut":false,"hidden":false,"merged":[[3,6,5,6],[7,6,9,6],[0,5,1,7],[11,6,12,6]]}
["List of Regions","List of Disasters","Country","Change Region for Country",null,"Use this form to:"]
[]
["Asia","Earthquake","Afghanistan","Asia"]
["East and Central Africa","Flood","Angola","Southern Africa",null,null,"Add a new Country: Type country name into first empty cell at the bottom of the left column. Select all country and region cells and use Excel 'Data' menu to alphabetize the list."]
["Latin America and Carribean","Mass Movement","Bangladesh","Asia"]
["Middle East and Europe","Storm","Benin","West Africa"]
["Southern Africa","Volcano","Bolivia","Latin America and Carribean"]
["West Africa","Aggregate","Bosnia-Hercegovenia","Middle East and Europe",null,null,"Assign Countries to Regions: Click on region and select from the drop down list which region you would like the country to be assigned to."]
[null,null,"Brazil","Latin America and Carribean"]
[null,null,"Burundi","East and Central Africa"]
{"$rows_left_out":56}
{"sheet":"InputEPP","index":6,"n_rows":7,"n_cols":1,"rows_kept":7,"cut":false,"hidden":false,"merged":[[0,0,0,1]]}
["Input EPP Data"]
[]
["Disaster Data"]
["Country  "]
["Disaster Type"]
["Number of People Killed"]
["Estimated Total Number of People Affected (Not Killed)"]

{"sheet":"Output_Truc","index":7,"n_rows":59,"n_cols":18,"rows_kept":59,"cut":false,"hidden":false,"merged":[[11,1,21,1],[11,3,11,5],[13,3,13,5],[15,3,15,5],[17,3,17,5],[19,3,19,5],[21,3,21,5],[37,2,37,6],[58,2,58,6],[8,7,10,8],[2,5,2,6],[4,5,4,6],[23,3,23,5],[25,3,25,5],[27,3,27,5],[29,3,29,5]]}
[]
[]
[null,"Location","Latin America and Carribean",null,null,"EPP: Population Affected",null,null,"No EPP Record"]
[]
[null,"Disaster","Flood",null,null,"(EMDAT-EPP)% Difference",null,null,"No EPP Record"]
[]
[null,"Mean",122335.40901913044,null,null,null,null,null,null,null,null,null,null,null,null,null,null,0.1]
[null,null,null,null,null,null,null,null,null,null,null,null,null,null,null,null,null,0.2]
[null,"Count",338,null,true,null,"Enter Response Level","Choose a percentage of population affected to respond to.",null,null,null,null,null,null,null,null,null,0.3]
[null,null,null,null,null,null,1,null,null,null,null,null,null,null,null,null,null,0.4]
{"$rows_left_out":50}
{"sheet":"Multiple_Truc","index":8,"n_rows":61,"n_cols":18,"rows_kept":61,"cut":false,"hidden":false,"merged":[[8,7,10,8],[11,1,21,1],[11,3,11,5],[13,3,13,5],[15,3,15,5],[17,3,17,5],[19,3,19,5],[21,3,21,5],[60,2,60,6],[2,2,2,4],[39,2,39,6],[23,3,23,5],[25,3,25,5],[27,3,27,5],[29,3,29,5],[2,5,2,6],[4,5,4,6]]}
[]
[]
[null,"Locations","Benin, Haiti, Guatemala",null,null,"EPP: Population Affected",null,null,"No EPP Record"]
[]
[null,"Disaster","Flood",null,null,"(EMDAT-EPP)% Difference",null,null,"No EPP Record"]
[]
[null,"Mean",60242.248528712917,null,null,null,null,null,null,null,null,null,null,null,null,null,null,0.1]
[null,null,null,null,null,null,null,null,null,null,null,null,null,null,null,null,null,0.2]
[null,"Count",60,null,true,null,"Enter Response Level","Choose a percentage of population affected to respond to.",null,null,null,null,null,null,null,null,null,0.3]
[null,null,null,null,null,null,1,null,null,null,null,null,null,null,null,null,null,0.4]
{"$rows_left_out":52}
{"sheet":"OL","index":9,"n_rows":8,"n_cols":6,"rows_kept":8,"cut":false,"hidden":false,"merged":[[3,1,3,5]]}
[]
[]
[]
[null,"Outlier Disasters"]
[null,"Date (M/D/Y)","Region","Country","Disaster Type","Population Affected"]
[null,"11/0/1970","Latin America and Carribean","Colombia","Flood",10531035.741250584]
[null,"1/0/1983","Latin America and Carribean","Brazil","Flood",4403719.7733618664]
[null,"1988-02-02","Latin America and Carribean","Brazil","Flood",4018897.8525434942]

{"sheet":"OLM","index":10,"n_rows":5,"n_cols":6,"rows_kept":5,"cut":false,"hidden":false,"merged":[[3,1,3,5]]}
[]
[]
[]
[null,"Outlier Disasters"]
[null,"Date (M/D/Y)","Region","Country","Disaster Type","Population Affected"]

{"sheet":"ItemRequirementsQ1","index":11,"n_rows":29,"n_cols":9,"rows_kept":29,"cut":false,"hidden":false,"merged":[[3,1,3,5],[8,1,8,5],[20,1,22,1],[21,2,21,5],[12,2,12,5],[15,2,15,5],[5,2,5,5],[10,1,16,1],[4,1,6,1],[18,7,19,8],[10,8,12,8],[3,7,3,8],[4,7,4,8],[14,8,16,8]]}
[]
[]
[null,"ITEM",null,"REQUIREMENT","UNIT","PEOPLE/UNIT"]
[null,"FOOD",null,null,null,null,null,"POPULATION RECEIVING AID"]
[null,1,"BP5",1495546.2184873947,"Bars",2.3800000000000002E-2,null,35594]
[null,null,"<OR>"]
[null,null,"PLUMPY NUT",1495546.2184873947,"Satchets",2.3800000000000002E-2]
[]
[null,"WATER"]
[null,2,"Tap Stands",23.729333333333333,"Tap Stands",1500]
{"$rows_left_out":20}
{"sheet":"Master","index":12,"n_rows":2594,"n_cols":16,"rows_kept":2594,"cut":false,"hidden":true,"merged":[]}
["Day","Month","Year","End  ","Region","Country  ","Location  ","Type  ","Sub Type  ","Killed  ","Tot. Affected  ","Total Population Affected (Killed + Affected)","popVarnum","PopVar Totalpopaffected","E[x] + X*σ T/F","MaxVal"]
[2,1,1902,"1902-02-01","Latin America and Carribean","El Salvador",null,"Earthquake","Tsunami",185,null,185,9.535248041775457,1764.0208877284595,0,402]
[8,4,1902,"1902-08-04","Latin America and Carribean","Guatemala",null,"Volcano","Volcanic eruption",1000,null,1000,10.423076923076923,10423.076923076924,0,6599]
[18,4,1902,"18/04/1902","Latin America and Carribean","Guatemala","Quezaltenango, San Marcos ...","Earthquake","Earthquake (ground shaking)",2000,null,2000,10.423076923076923,20846.153846153848,0,106084]
[4,5,1902,"1902-04-05","Asia","Myanmar","Rangoon","Storm","Tropical cyclone",600,null,600,4.7681344603892271,2860.8806762335362,0,359999]
[24,10,1902,"24/10/1902","Latin America and Carribean","Guatemala",null,"Volcano","Volcanic eruption",6000,null,6000,10.423076923076923,62538.461538461539,0,6599]
[5,4,1905,"1905-05-04","Asia","India","Kangra","Earthquake","Earthquake (ground shaking)",20000,null,20000,5.0173560015489,100347.120030978,0,18701103]
[31,1,1906,"31/01/1906","Latin America and Carribean","Colombia","Tumako","Earthquake","Earthquake (ground shaking)",400,null,400,11.056778389194598,4422.7113556778395,0,86069]
[4,2,1906,"1906-04-02","Latin America and Carribean","Nicaragua","Masaya","Earthquake","Earthquake (ground shaking)",1000,null,1000,12.543933054393305,12543.933054393305,0,24882]
[4,2,1907,"1907-04-02","Asia","Indonesia","Aceh coast (North Sumatra ...","Earthquake","Tsunami",400,null,400,5.6839938239835304,2273.5975295934122,0,455328]
{"$rows_left_out":2585}
{"sheet":"StatTrucOut","index":13,"n_rows":124,"n_cols":18,"rows_kept":124,"cut":false,"hidden":false,"merged":[]}
["Location","Disaster","Number of Observations (N)","Sqrt (N)","Mean","Variance","Standard Deviation","p- value","Quantile.1","Quantile.2","Quantile.3","Quantile.4","Quantile.5","Quantile.6","Quantile.7","Quantile.8","Quantile.9","Quantile.99"]
["Latin America and Carribean","Flood",338,18.384776310850235,156642.93786982249,0,0,null,null,4287,null,17973,34814,60891,null,154808,null,901538]
[]
[]
[]
[]
[]
["Year","Year Count","Num Aff","Month","Month Count"]
[1900,null,null,"January",42]
[1901,null,null,"February",37]
{"$rows_left_out":115}
{"sheet":"StatWithOut","index":14,"n_rows":1,"n_cols":19,"rows_kept":1,"cut":false,"hidden":false,"merged":[]}
["Location","Disaster","Number of Observations (N)","Sqrt (N)","Mean","Variance","Standard Deviation","p- value","Quantile.1","Quantile.2","Quantile.3","Quantile.4","Quantile.5","Quantile.6","Quantile.7","Quantile.8","Quantile.9","Quantile.99","Max Non-Out Val"]

{"sheet":"ButtonOutputs","index":15,"n_rows":15,"n_cols":4,"rows_kept":15,"cut":false,"hidden":true,"merged":[]}
["Box Outputs","Country","Region","Mult Countries"]
["Output1",1,4,1]
["Output2",null,null,1]
["Output3",null,null,1]
["Output4",null,null,1]
["Output5",null,null,1]
["Disaster",1,3,1]
[]
["Outputs Name","Country","Region","Mult Countries"]
["Output1",{"$f":"INDEX(EditRegionCountry!$C$2:$C$59,B2)","v":0},{"$f":"INDEX(EditRegionCountry!A2:A8,C2)","v":"Latin America and Carribean"},{"$f":"IF(INDEX(EditRegionCountry!$C$2:$C$65,D2)=0,\"\",INDEX(EditRegionCountry!$C$2:$C$65,D2))","v":""}]
{"$rows_left_out":6}
{"sheet":"GF","index":16,"n_rows":60,"n_cols":17,"rows_kept":60,"cut":false,"hidden":true,"merged":[]}
["GROWTH FACTORS",1915,1940,1952,1957,1962,1967,1972,1977,1982,1987,1992,1997,2002,2007,2010]
["Afghanistan",5.579796328462276,4.5764625814090518,3.5731288343558281,3.275334608030593,2.9627632516024009,2.6478450627386798,2.342611213900732,2.0606425134446646,1.9357218824780644,2.2239957232320147,2.1652910997100157,1.5146676375741184,1.3224195086508332,1.1403007283264155,1,0.89385800669142701]
["Bangladesh",5.6926854984892925,4.5777759525921464,3.4628664066950008,3.1875857062192465,2.8953528840693861,2.6220224271780239,2.3475962038288456,2.0756372040497419,1.7974913858785266,1.5941464792141518,1.4184337338585928,1.2733907999677758,1.1564592006204228,1.0678619925551105,1,0.93629347059903689]
["India",5.0173560015489,4.0944733938749147,3.1715907862009298,2.9018077117159904,2.6338716594109024,2.3700875215167163,2.1179478198700461,1.8954021744223433,1.7128464800084102,1.5443515900222746,1.3996246535561869,1.2743070982038596,1.1657636887608069,1.0752860061614724,1,0.93721478697702953]
["Indonesia",5.6839938239835304,4.3060476242287438,2.9281014244739572,2.6920170627666056,2.4261378387554169,2.1937627534897159,1.9867857259673569,1.7961440652906735,1.6147593824559539,1.4626141500972194,1.3366782197282281,1.2285754737970511,1.1362724419980452,1.0614777016636376,1,0.94998807471095836]
["Myanmar",4.7681344603892271,3.6287049559745808,2.4892754515599345,2.304560570071259,2.1240422085029991,1.9453422625015038,1.7709268791297046,1.5991758694577221,1.4673179879616467,1.3346998294172674,1.2361695079377213,1.1618566330563074,1.0950317148597097,1.0410979483217444,1,0.9648554039540157]
["Nepal",6.0184554230550864,4.6194613044085218,3.2204671857619576,3.0543306255934168,2.8851021425012457,2.6654391456453692,2.4290628408423527,2.2006688963210701,1.9742243436754177,1.7472540736270368,1.5303943334390528,1.3233990035196781,1.1665726488838746,1.0685760685022514,1,0.91762543184051215]
["Pakistan",7.2912607902351683,5.8926010907168536,4.4939413911985397,3.9896700724670295,3.518308293805942,3.0833463779459085,2.6980336651142971,2.3728049041653283,2.0802520564662812,1.7870845472232584,1.5354241369155883,1.3619301507306056,1.2013974071388394,1.0850992201941558,1,0.9293585388357658]
["Papua New Guinea",4.4281918359911598,4.3617588075139935,4.2953257790368271,3.9255663430420711,3.5302677532013971,3.1246780010303965,2.739385727190605,2.4221246006389778,2.1310611384399158,1.8782904924125117,1.6467553624762421,1.4385673624288424,1.2601288177851653,1.114889705882353,1,0.90902278177458029]
["Sri Lanka",5.5881901840490826,4.2220786311191913,2.8559670781893005,2.4745801702323442,2.1702814486028448,1.9104875233105407,1.704889452413028,1.5613614921256986,1.4289319872476089,1.3290091425747468,1.2389288799308955,1.1644295302013423,1.1069150030870549,1.0492586812329301,1,0.96117589241835322]
{"$rows_left_out":51}
{"sheet":"Outliers","index":17,"n_rows":39,"n_cols":11,"rows_kept":39,"cut":false,"hidden":true,"merged":[]}
["E[x] + X*σ","Asia","Latin America and Carribean","East and Central Africa","West Africa","Southern Africa","Middle East and Europe",null,null,"STDEV Mult:","User input"]
["Earthquake",13975809.86866199,5492012.2869732399,271086.4030415556,169723.45669795031,155178.01693532651,275630.920829123,null,"Asia",9]
["Flood",63522695.474939324,3556708.850310056,1871738.7182407829,2011939.8063764479,4297338.1528206468,485125.5884744681,null,"East and Central Africa",5]
["Mass Movement",2061650.8353283487,3480991.357122635,11021.313148452278,57540.293976111519,14198.671942511008,3080.3457183782557,null,"Latin America and Carribean",5]
["Storm",16410388.660487382,5557931.8664710196,86499.472314605737,26365.387555299658,3987033.8331851447,40001.171655897837,null,"Middle East and Europe",5]
["Volcano",494401.43684033677,674542.17544136744,45991.198872959139,62057.871015118268,{"$error":"#DIV/0!"},{"$error":"#DIV/0!"},null,"Southern Africa",5]
[null,null,null,null,null,null,null,null,"West Africa",5]
[]
["Location","St Dev Mult","Disaster","Dist","Number of Observations (N)","Sqrt (N)","Mean","Variance","Standard Deviation","X * Std Dev","Mean + X*StDev"]
["Asia",{"$f":"$J$2","v":9},"Earthquake","Geometric",172,13.114877048604001,334227.65116279072,5085529150222.0059,2255111.7822010522,20296006.039809469,20630233.690972261]
{"$rows_left_out":30}
{"sheet":"EPP","index":18,"n_rows":29,"n_cols":4,"rows_kept":29,"cut":false,"hidden":true,"merged":[]}
["Country","Region","Disaster","AvgOfTotal Population Affected (EPP)"]
["Burundi","East and Central Africa","Armed Conflict",3500000]
["Ghana","West Africa","Drought",2676884]
["Indonesia","Asia","Earthquake",1000000]
["Indonesia","Asia","Flood",3333333.3333333335]
["Kosovo","Middle East and Europe","Avian Flu Epidemic",1000000]
["Kosovo","Middle East and Europe","Interethnic Violence",40000]
["Mozambique","Southern Africa","Storm",686000]
["Mozambique","Southern Africa","Drought",357000]
["Mozambique","Southern Africa","Flood",210500]
{"$rows_left_out":20}
{"sheet":"ItemData","index":19,"n_rows":44,"n_cols":12,"rows_kept":44,"cut":false,"hidden":true,"merged":[]}
["Item","Category","Vendor","Unit","UnitsPerPackage","PackageWeightKG","UnitWeightKG","PackageCoverage","UnitCoverage","PackagePrice","UnitPrice","Comment"]
["BP5Biscuit","FOOD",null,"Box",216,13.6,6.3E-2,5.14,2.3800000000000002E-2,null,null,"1 carton box contains 24 packs, 9 bars per pack; 216 bars per box; 5 person HH eating 3 bars per day for two week is 210 bars"]
["PlumpyNut","FOOD","Techno Relief","Carton",150,13.8,9.1999999999999998E-2,3.57,2.3800000000000002E-2,73.27,0.49,"Carton/box of 150 satchets; 20 month shelf life; 50 beneficiaries per day per carton; 3.57 beneficiaries per two week per carton"]
["ORS","REHYDRATION","Techno Relief","Carton",null,null,null,null,null,null,0.105,"Oral Rehydration Salts; treats diarrhoeal dehydration"]
["ORS","REHYDRATION","UNICEF",null,1000,null,null,null,null,106.5,0.107]
["Water Tank 5kL","WATERTANK","Scan-Water","Single",1,83,83,"3 per disaster for now",null,1456.9,1456.9,"Water storage tank, collapsible, 5,000 litres with truck harness; www.scan-water.com"]
["Water Tank 5kL","WATERTANK","Techno Relief",null,null,null,null,null,null,1179]
["Water Tank 10kL","WATERTANK"]
["TapStands","TAPSTAND","Scan-Water","Single",4,80,19,6000,1500,436.21,109.05,"6-tap station; www.scan-water.com; Standard is 250 people / 50 HH per tap"]
["TapStands","TAPSTAND","Techno Relief",null,null,null,null,null,null,820]
{"$rows_left_out":35}
{"sheet":"DisasterSupplyBasis","index":20,"n_rows":31,"n_cols":13,"rows_kept":31,"cut":false,"hidden":true,"merged":[]}
["DisasterType","Region","FOOD","WATERPURIFIER","WATERTANK","TAPSTAND","JERRYCAN","SHELTER","BLANKET","SLEEPMAT","HYGIENEKIT","MOSQUITONET","REHYDRATION"]
["Earthquake","EastAndCentralAfrica",1,1,1,1,1,1,1,1,1,0,0]
["Earthquake","WestAfrica",1,1,1,1,1,1,1,1,1,0,0]
["Earthquake","SouthernAfrica",1,1,1,1,1,1,1,1,1,0,0]
["Earthquake","Asia",1,1,1,1,1,1,1,1,1,0,0]
["Earthquake","LatinAmericaAndTheCaribbean",1,1,1,1,1,1,1,1,1,0,0]
["Earthquake","MiddleEastAndEurope",1,1,1,1,1,1,1,1,1,0,0]
["MassMovement","EastAndCentralAfrica",1,1,1,1,1,1,1,1,1,0,0]
["MassMovement","WestAfrica",1,1,1,1,1,1,1,1,1,0,0]
["MassMovement","SouthernAfrica",1,1,1,1,1,1,1,1,1,0,0]
{"$rows_left_out":21}